Reaction Details
TargetAdenosine receptor A2b
LigandBDBM50410731
Substrate/Competitorn/a
Meas. Tech.ChEMBL_330270 (CHEMBL862098)
Ki 4.68±n/a nM
Citation Carotti, ACadavid, MICenteno, NBEsteve, CLoza, MIMartinez, ANieto, RRaviña, ESanz, FSegarra, VSotelo, EStefanachi, AVidal, B Design, synthesis, and structure-activity relationships of 1-,3-,8-, and 9-substituted-9-deazaxanthines at the human A2B adenosine receptor. J Med Chem49:282-99 (2006) 
 
Adenosine receptor A2b
Name:Adenosine receptor A2b
Type:G Protein-Coupled Receptor (GPCR)
Mol. Mass.:36341.22
Organism:Homo sapiens (Human)
Description:n/a
Residue:332
BDBM50410731
NameBDBM50410731
Synonyms:CHEMBL199862
TypeSmall organic molecule
Emp. Form.C28H28N4O4
Mol. Mass.484.5463
SMILESO=C(COc1ccc(cc1)-c1cc2n(CC3CC3)c(=O)n(CC3CC3)c(=O)c2[nH]1)Nc1ccccc1