Reaction Details
TargetP2X purinoceptor 7
LigandBDBM50410942
Substrate/Competitorn/a
Meas. Tech.ChEMBL_364091 (CHEMBL870213)
IC50 25.12±n/a nM
Citation Nelson, DWGregg, RJKort, MEPerez-Medrano, AVoight, EAWang, YGrayson, GNamovic, MTDonnelly-Roberts, DLNiforatos, WHonore, PJarvis, MFFaltynek, CRCarroll, WA Structure-activity relationship studies on a series of novel, substituted 1-benzyl-5-phenyltetrazole P2X7 antagonists. J Med Chem49:3659-66 (2006) 
 
P2X purinoceptor 7
Name:P2X purinoceptor 7
Type:Protein
Mol. Mass.:68602.85
Organism:Homo sapiens (Human)
Description:Q99572
Residue:595
BDBM50410942
NameBDBM50410942
Synonyms:CHEMBL207525
TypeSmall organic molecule
Emp. Form.C13H8Cl2FN5
Mol. Mass.324.141
SMILESFc1ccc(c(Cl)c1Cl)-n1nnnc1Cc1cccnc1