Reaction Details
TargetCathepsin K
LigandBDBM50374300
Substrate/Competitorn/a
Meas. Tech.ChEMBL_365368 (CHEMBL871198)
Ki 7.9±n/a nM
Citation Palmer, JTHirschbein, BLCheung, HMcCarter, JJanc, JWYu, ZWWesolowski, G Keto-1,3,4-oxadiazoles as cathepsin K inhibitors. Bioorg Med Chem Lett16:2909-14 (2006) 
 
Cathepsin K
Name:Cathepsin K
Type:Enzyme
Mol. Mass.:36975.68
Organism:Homo sapiens (Human)
Description:P43235
Residue:329
BDBM50374300
NameBDBM50374300
Synonyms:CHEMBL405602
TypeSmall organic molecule
Emp. Form.C24H29F3N4O5
Mol. Mass.510.5061
SMILESCCC[C@H](NC(=O)C1(CCCCC1)NC(=O)c1ccc(OC(F)(F)F)cc1)C(=O)c1nnc(CC)o1