Reaction Details
TargetCathepsin K
LigandBDBM50374292
Substrate/Competitorn/a
Meas. Tech.ChEMBL_365368 (CHEMBL871198)
Ki 54±n/a nM
Citation Palmer, JTHirschbein, BLCheung, HMcCarter, JJanc, JWYu, ZWWesolowski, G Keto-1,3,4-oxadiazoles as cathepsin K inhibitors. Bioorg Med Chem Lett16:2909-14 (2006) 
 
Cathepsin K
Name:Cathepsin K
Type:Enzyme
Mol. Mass.:36975.68
Organism:Homo sapiens (Human)
Description:P43235
Residue:329
BDBM50374292
NameBDBM50374292
Synonyms:CHEMBL208566
TypeSmall organic molecule
Emp. Form.C29H28F6N4O5
Mol. Mass.626.5468
SMILESCCC[C@H](NC(=O)C1(CCCCC1)NC(=O)c1ccc(OC(F)(F)F)cc1)C(=O)c1nnc(o1)-c1cccc(c1)C(F)(F)F