Reaction Details
TargetAlpha-1B adrenergic receptor
LigandBDBM50411195
Substrate/Competitorn/a
Meas. Tech.ChEMBL_412941 (CHEMBL910640)
Ki 11±n/a nM
Citation Pallavicini, MBudriesi, RFumagalli, LIoan, PChiarini, ABolchi, CUgenti, MPColleoni, SGobbi, MValoti, E WB4101-related compounds: new, subtype-selective alpha1-adrenoreceptor antagonists (or inverse agonists?). J Med Chem49:7140-9 (2006) 
 
Alpha-1B adrenergic receptor
Name:Alpha-1B adrenergic receptor
Type:Enzyme
Mol. Mass.:56862.13
Organism:Homo sapiens (Human)
Description:P35368
Residue:520
BDBM50411195
NameBDBM50411195
Synonyms:CHEMBL214694
TypeSmall organic molecule
Emp. Form.C24H25NO4
Mol. Mass.391.4596
SMILESCOc1ccc(cc1OCCNC[C@H]1COc2ccccc2O1)-c1ccccc1