Reaction Details
TargetAlpha-1A adrenergic receptor
LigandBDBM50411193
Substrate/Competitorn/a
Meas. Tech.ChEMBL_412940 (CHEMBL910638)
Ki 1.2±n/a nM
Citation Pallavicini, MBudriesi, RFumagalli, LIoan, PChiarini, ABolchi, CUgenti, MPColleoni, SGobbi, MValoti, E WB4101-related compounds: new, subtype-selective alpha1-adrenoreceptor antagonists (or inverse agonists?). J Med Chem49:7140-9 (2006) 
 
Alpha-1A adrenergic receptor
Name:Alpha-1A adrenergic receptor
Type:Cell-surface receptors
Mol. Mass.:51511.67
Organism:Homo sapiens (Human)
Description:P35348
Residue:466
BDBM50411193
NameBDBM50411193
Synonyms:CHEMBL215151
TypeSmall organic molecule
Emp. Form.C24H25NO4
Mol. Mass.391.4596
SMILESCOc1cccc(-c2ccccc2)c1OCCNC[C@H]1COc2ccccc2O1