Reaction Details
TargetAlpha-1D adrenergic receptor
LigandBDBM50411188
Substrate/Competitorn/a
Meas. Tech.ChEMBL_412942 (CHEMBL910642)
Ki 6.6±n/a nM
Citation Pallavicini, MBudriesi, RFumagalli, LIoan, PChiarini, ABolchi, CUgenti, MPColleoni, SGobbi, MValoti, E WB4101-related compounds: new, subtype-selective alpha1-adrenoreceptor antagonists (or inverse agonists?). J Med Chem49:7140-9 (2006) 
 
Alpha-1D adrenergic receptor
Name:Alpha-1D adrenergic receptor
Type:Enzyme Catalytic Domain
Mol. Mass.:60485.82
Organism:Homo sapiens (Human)
Description:adrenergic Alpha1D ADRA1D HUMAN::P25100
Residue:572
BDBM50411188
NameBDBM50411188
Synonyms:CHEMBL217469
TypeSmall organic molecule
Emp. Form.C22H23NO4
Mol. Mass.365.4223
SMILESCOc1ccc2ccccc2c1OCCNC[C@H]1COc2ccccc2O1