Reaction Details
TargetMelatonin receptor type 1C
LigandBDBM50423060
Substrate/Competitorn/a
Meas. Tech.ChEMBL_443034 (CHEMBL892165)
IC50 5129±n/a nM
Citation Tsotinis, APanoussopoulou, MEleutheriades, ADavidson, KSugden, D Design, synthesis and melatoninergic activity of new unsubstituted and beta,beta'-difunctionalised 2,3-dihydro-1H-pyrrolo[3,2,1-ij]quinolin-6-alkanamides. Eur J Med Chem42:1004-13 (2007) 
 
Melatonin receptor type 1C
Name:Melatonin receptor type 1C
Type:Enzyme Catalytic Domain
Mol. Mass.:47442.40
Organism:Xenopus
Description:Melatonin 1C 0 Xenopus::P49219
Residue:420
BDBM50423060
NameBDBM50423060
Synonyms:CHEMBL241928
TypeSmall organic molecule
Emp. Form.C16H20N2O
Mol. Mass.256.3428
SMILESCC(=O)NCCCc1cn2CCCc3cccc1c23