Reaction Details
TargetMelatonin receptor type 1C
LigandBDBM50423061
Substrate/Competitorn/a
Meas. Tech.ChEMBL_443034 (CHEMBL892165)
IC50 2042±n/a nM
Citation Tsotinis, APanoussopoulou, MEleutheriades, ADavidson, KSugden, D Design, synthesis and melatoninergic activity of new unsubstituted and beta,beta'-difunctionalised 2,3-dihydro-1H-pyrrolo[3,2,1-ij]quinolin-6-alkanamides. Eur J Med Chem42:1004-13 (2007) 
 
Melatonin receptor type 1C
Name:Melatonin receptor type 1C
Type:Enzyme Catalytic Domain
Mol. Mass.:47442.40
Organism:Xenopus
Description:Melatonin 1C 0 Xenopus::P49219
Residue:420
BDBM50423061
NameBDBM50423061
Synonyms:CHEMBL243003
TypeSmall organic molecule
Emp. Form.C22H30N2O
Mol. Mass.338.4864
SMILESCCCC(=O)NCC1(CCCCC1)c1cn2CCCc3cccc1c23