Reaction Details
TargetThyroid hormone receptor beta
LigandBDBM18940
Substrate/Competitorn/a
Meas. Tech.ChEMBL_447974 (CHEMBL898226)
IC50 1.1±n/a nM
Citation Liu, HGramatica, P QSAR study of selective ligands for the thyroid hormone receptor beta. Bioorg Med Chem15:5251-61 (2007) 
 
Thyroid hormone receptor beta
Name:Thyroid hormone receptor beta
Type:Receptor
Mol. Mass.:52793.62
Organism:Homo sapiens (Human)
Description:Recombinant hThR was obtained from nuclear extracts from SF9 cells infected with baculovirus vectors encoding for ThRbeta 1.
Residue:461
BDBM18940
NameBDBM18940
Synonyms:2-(3,5-dibromo-4-{4-hydroxy-3-[3-(trifluoromethyl)phenoxy]phenoxy}phenyl)acetic acid | 4-hydroxy thyromimetic, 13c
TypeSmall organic molecule
Emp. Form.C21H13Br2F3O5
Mol. Mass.562.128
SMILESOC(=O)Cc1cc(Br)c(Oc2ccc(O)c(Oc3cccc(c3)C(F)(F)F)c2)c(Br)c1