Reaction Details
TargetThyroid hormone receptor beta
LigandBDBM50411422
Substrate/Competitorn/a
Meas. Tech.ChEMBL_447974 (CHEMBL898226)
IC50 0.646±n/a nM
Citation Liu, HGramatica, P QSAR study of selective ligands for the thyroid hormone receptor beta. Bioorg Med Chem15:5251-61 (2007) 
 
Thyroid hormone receptor beta
Name:Thyroid hormone receptor beta
Type:Receptor
Mol. Mass.:52793.62
Organism:Homo sapiens (Human)
Description:Recombinant hThR was obtained from nuclear extracts from SF9 cells infected with baculovirus vectors encoding for ThRbeta 1.
Residue:461
BDBM50411422
NameBDBM50411422
Synonyms:CHEMBL237096
TypeSmall organic molecule
Emp. Form.C23H16Cl2N4O6S
Mol. Mass.547.367
SMILESOc1ccc(Oc2c(Cl)cc(cc2Cl)-n2ncc(=O)[nH]c2=O)cc1S(=O)(=O)N1CCc2ccccc12