Reaction Details
TargetThyroid hormone receptor beta
LigandBDBM50123056
Substrate/Competitorn/a
Meas. Tech.ChEMBL_447974 (CHEMBL898226)
IC50 1.29±n/a nM
Citation Liu, HGramatica, P QSAR study of selective ligands for the thyroid hormone receptor beta. Bioorg Med Chem15:5251-61 (2007) 
 
Thyroid hormone receptor beta
Name:Thyroid hormone receptor beta
Type:Receptor
Mol. Mass.:52793.62
Organism:Homo sapiens (Human)
Description:Recombinant hThR was obtained from nuclear extracts from SF9 cells infected with baculovirus vectors encoding for ThRbeta 1.
Residue:461
BDBM50123056
NameBDBM50123056
Synonyms:2-(4-(4-hydroxy-3-(piperidin-1-ylsulfonyl)phenoxy)-3,5-dimethylphenyl)-1,2,4-triazine-3,5(2H,4H)-dione2-(4-(4-hydroxy-3-(piperidin-1-ylsulfonyl)phenoxy)-3,5-dimethylphenyl)-1,2,4-triazine-3,5(2H,4H)-dione CHEMBL333650
TypeSmall organic molecule
Emp. Form.C22H24N4O6S
Mol. Mass.472.514
SMILESCc1cc(cc(C)c1Oc1ccc(O)c(c1)S(=O)(=O)N1CCCCC1)-n1ncc(=O)[nH]c1=O