Reaction Details
TargetThyroid hormone receptor beta
LigandBDBM18867
Substrate/Competitorn/a
Meas. Tech.ChEMBL_447974 (CHEMBL898226)
IC50 0.0955±n/a nM
Citation Liu, HGramatica, P QSAR study of selective ligands for the thyroid hormone receptor beta. Bioorg Med Chem15:5251-61 (2007) 
 
Thyroid hormone receptor beta
Name:Thyroid hormone receptor beta
Type:Receptor
Mol. Mass.:52793.62
Organism:Homo sapiens (Human)
Description:Recombinant hThR was obtained from nuclear extracts from SF9 cells infected with baculovirus vectors encoding for ThRbeta 1.
Residue:461
BDBM18867
NameBDBM18867
Synonyms:2-{3,5-dibromo-4-[4-hydroxy-3-(propan-2-yl)phenoxy]phenyl}acetic acid dibromo phenylacetic acid, 11a
TypeSmall organic molecule
Emp. Form.C17H16Br2O4
Mol. Mass.444.115
SMILESCC(C)c1cc(Oc2c(Br)cc(CC(O)=O)cc2Br)ccc1O