Reaction Details
TargetThyroid hormone receptor beta
LigandBDBM18916
Substrate/Competitorn/a
Meas. Tech.ChEMBL_447974 (CHEMBL898226)
IC50 4.27±n/a nM
Citation Liu, HGramatica, P QSAR study of selective ligands for the thyroid hormone receptor beta. Bioorg Med Chem15:5251-61 (2007) 
 
Thyroid hormone receptor beta
Name:Thyroid hormone receptor beta
Type:Receptor
Mol. Mass.:52793.62
Organism:Homo sapiens (Human)
Description:Recombinant hThR was obtained from nuclear extracts from SF9 cells infected with baculovirus vectors encoding for ThRbeta 1.
Residue:461
BDBM18916
NameBDBM18916
Synonyms:2-{4-[3-bromo-4-(2-methylbutanamido)phenoxy]-3,5-dichlorophenyl}acetic acid | 4-amido bioisosteric ligand, 12c
TypeSmall organic molecule
Emp. Form.C19H18BrCl2NO4
Mol. Mass.475.161
SMILESCCC(C)C(=O)Nc1ccc(Oc2c(Cl)cc(CC(O)=O)cc2Cl)cc1Br