Reaction Details
TargetThyroid hormone receptor beta
LigandBDBM50123055
Substrate/Competitorn/a
Meas. Tech.ChEMBL_447974 (CHEMBL898226)
IC50 2±n/a nM
Citation Liu, HGramatica, P QSAR study of selective ligands for the thyroid hormone receptor beta. Bioorg Med Chem15:5251-61 (2007) 
 
Thyroid hormone receptor beta
Name:Thyroid hormone receptor beta
Type:Receptor
Mol. Mass.:52793.62
Organism:Homo sapiens (Human)
Description:Recombinant hThR was obtained from nuclear extracts from SF9 cells infected with baculovirus vectors encoding for ThRbeta 1.
Residue:461
BDBM50123055
NameBDBM50123055
Synonyms:2-(3,5-dichloro-4-(4-hydroxy-3-(morpholine-4-carbonyl)phenoxy)phenyl)-1,2,4-triazine-3,5(2H,4H)-dione CHEMBL124819
TypeSmall organic molecule
Emp. Form.C20H16Cl2N4O6
Mol. Mass.479.27
SMILESOc1ccc(Oc2c(Cl)cc(cc2Cl)-n2ncc(=O)[nH]c2=O)cc1C(=O)N1CCOCC1