Reaction Details
TargetThyroid hormone receptor beta
LigandBDBM18953
Substrate/Competitorn/a
Meas. Tech.ChEMBL_447974 (CHEMBL898226)
IC50 0.468±n/a nM
Citation Liu, HGramatica, P QSAR study of selective ligands for the thyroid hormone receptor beta. Bioorg Med Chem15:5251-61 (2007) 
 
Thyroid hormone receptor beta
Name:Thyroid hormone receptor beta
Type:Receptor
Mol. Mass.:52793.62
Organism:Homo sapiens (Human)
Description:Recombinant hThR was obtained from nuclear extracts from SF9 cells infected with baculovirus vectors encoding for ThRbeta 1.
Residue:461
BDBM18953
NameBDBM18953
Synonyms:2-[3,5-dibromo-4-(4-hydroxy-3-{[2-(2-methoxyphenyl)ethyl]carbamoyl}phenoxy)phenyl]acetic acid | 4-hydroxy thyromimetic, 15h
TypeSmall organic molecule
Emp. Form.C24H21Br2NO6
Mol. Mass.579.235
SMILESCOc1ccccc1CCNC(=O)c1cc(Oc2c(Br)cc(CC(O)=O)cc2Br)ccc1O