Reaction Details
TargetThyroid hormone receptor beta
LigandBDBM18950
Substrate/Competitorn/a
Meas. Tech.ChEMBL_447974 (CHEMBL898226)
IC50 18.2±n/a nM
Citation Liu, HGramatica, P QSAR study of selective ligands for the thyroid hormone receptor beta. Bioorg Med Chem15:5251-61 (2007) 
 
Thyroid hormone receptor beta
Name:Thyroid hormone receptor beta
Type:Receptor
Mol. Mass.:52793.62
Organism:Homo sapiens (Human)
Description:Recombinant hThR was obtained from nuclear extracts from SF9 cells infected with baculovirus vectors encoding for ThRbeta 1.
Residue:461
BDBM18950
NameBDBM18950
Synonyms:2-(3,5-dibromo-4-{4-hydroxy-3-[(4-phenylbutyl)carbamoyl]phenoxy}phenyl)acetic acid | 4-hydroxy thyromimetic, 15e
TypeSmall organic molecule
Emp. Form.C25H23Br2NO5
Mol. Mass.577.262
SMILESOC(=O)Cc1cc(Br)c(Oc2ccc(O)c(c2)C(=O)NCCCCc2ccccc2)c(Br)c1