Reaction Details
TargetThyroid hormone receptor beta
LigandBDBM18951
Substrate/Competitorn/a
Meas. Tech.ChEMBL_447974 (CHEMBL898226)
IC50 4.79±n/a nM
Citation Liu, HGramatica, P QSAR study of selective ligands for the thyroid hormone receptor beta. Bioorg Med Chem15:5251-61 (2007) 
 
Thyroid hormone receptor beta
Name:Thyroid hormone receptor beta
Type:Receptor
Mol. Mass.:52793.62
Organism:Homo sapiens (Human)
Description:Recombinant hThR was obtained from nuclear extracts from SF9 cells infected with baculovirus vectors encoding for ThRbeta 1.
Residue:461
BDBM18951
NameBDBM18951
Synonyms:2-[3,5-dibromo-4-(4-hydroxy-3-{[2-(4-methoxyphenyl)ethyl]carbamoyl}phenoxy)phenyl]acetic acid | 4-hydroxy thyromimetic, 15f
TypeSmall organic molecule
Emp. Form.C24H21Br2NO6
Mol. Mass.579.235
SMILESCOc1ccc(CCNC(=O)c2cc(Oc3c(Br)cc(CC(O)=O)cc3Br)ccc2O)cc1