Reaction Details
TargetThyroid hormone receptor beta
LigandBDBM18862
Substrate/Competitorn/a
Meas. Tech.ChEMBL_447974 (CHEMBL898226)
IC50 0.0479±n/a nM
Citation Liu, HGramatica, P QSAR study of selective ligands for the thyroid hormone receptor beta. Bioorg Med Chem15:5251-61 (2007) 
 
Thyroid hormone receptor beta
Name:Thyroid hormone receptor beta
Type:Receptor
Mol. Mass.:52793.62
Organism:Homo sapiens (Human)
Description:Recombinant hThR was obtained from nuclear extracts from SF9 cells infected with baculovirus vectors encoding for ThRbeta 1.
Residue:461
BDBM18862
NameBDBM18862
Synonyms:2-[4-(4-hydroxy-3-iodophenoxy)-3,5-diiodophenyl]acetic acid TRIAC Triiodothyroacetic acid, 3 | US10322118, Entry Tiratricol
TypeSmall organic molecule
Emp. Form.C14H9I3O4
Mol. Mass.621.9323
SMILESOC(=O)Cc1cc(I)c(Oc2ccc(O)c(I)c2)c(I)c1