Reaction Details
TargetThyroid hormone receptor beta
LigandBDBM18883
Substrate/Competitorn/a
Meas. Tech.ChEMBL_447974 (CHEMBL898226)
IC50 912.01±n/a nM
Citation Liu, HGramatica, P QSAR study of selective ligands for the thyroid hormone receptor beta. Bioorg Med Chem15:5251-61 (2007) 
 
Thyroid hormone receptor beta
Name:Thyroid hormone receptor beta
Type:Receptor
Mol. Mass.:52793.62
Organism:Homo sapiens (Human)
Description:Recombinant hThR was obtained from nuclear extracts from SF9 cells infected with baculovirus vectors encoding for ThRbeta 1.
Residue:461
BDBM18883
NameBDBM18883
Synonyms:3,5-dibromo-4-[4-hydroxy-3,5-bis(propan-2-yl)phenoxy]benzoic acid thyromimetic, 4
TypeSmall organic molecule
Emp. Form.C19H20Br2O4
Mol. Mass.472.168
SMILESCC(C)c1cc(Oc2c(Br)cc(cc2Br)C(O)=O)cc(C(C)C)c1O