Reaction Details
TargetThyroid hormone receptor beta
LigandBDBM18865
Substrate/Competitorn/a
Meas. Tech.ChEMBL_447974 (CHEMBL898226)
IC50 0.0251±n/a nM
Citation Liu, HGramatica, P QSAR study of selective ligands for the thyroid hormone receptor beta. Bioorg Med Chem15:5251-61 (2007) 
 
Thyroid hormone receptor beta
Name:Thyroid hormone receptor beta
Type:Receptor
Mol. Mass.:52793.62
Organism:Homo sapiens (Human)
Description:Recombinant hThR was obtained from nuclear extracts from SF9 cells infected with baculovirus vectors encoding for ThRbeta 1.
Residue:461
BDBM18865
NameBDBM18865
Synonyms:3-{3,5-dibromo-4-[4-hydroxy-3-(propan-2-yl)phenoxy]phenyl}propanoic acid dibromo phenylpropionic acid, 6
TypeSmall organic molecule
Emp. Form.C18H18Br2O4
Mol. Mass.458.141
SMILESCC(C)c1cc(Oc2c(Br)cc(CCC(O)=O)cc2Br)ccc1O