Reaction Details
TargetNeuronal acetylcholine receptor subunit alpha-4/beta-2
LigandBDBM50143320
Substrate/Competitorn/a
Meas. Tech.ChEMBL_452154 (CHEMBL901310)
Ki 0.026±n/a nM
Citation Carroll, FIRobinson, TPBrieaddy, LEAtkinson, RNMascarella, SWDamaj, MIMartin, BRNavarro, HA Synthesis and nicotinic acetylcholine receptor binding properties of bridged and fused ring analogues of epibatidine. J Med Chem50:6383-91 (2007) 
 
Neuronal acetylcholine receptor subunit alpha-4/beta-2
Name:Neuronal acetylcholine receptor subunit alpha-4/beta-2
Type:Protein
Mol. Mass.:n/a
Description:n/a
Components:This complex has 2 components.
Component 1
Name:Neuronal acetylcholine receptor subunit alpha-4
Synonyms:ACHA4_HUMAN CHRNA4 protein Neuronal acetylcholine receptor protein alpha-4 subunit Nicotinic acetylcholine receptor alpha4/beta2/alpha5
Type:n/a
Mol. Mass.:69963.49
Organism:Homo sapiens (Human)
Description:NACHRA4
Residue:627
Component 2
Name:Neuronal acetylcholine receptor subunit beta-2
Synonyms:ACHB2_HUMAN Neuronal acetylcholine receptor protein beta-2 subunit | Nicotinic acetylcholine receptor alpha3/beta2/alpha5
Type:Protein
Mol. Mass.:57020.50
Organism:Homo sapiens (Human)
Description:P17787
Residue:502
BDBM50143320
NameBDBM50143320
Synonyms:(+)-epibatidine (1S,2S,4R)-2-(6-Chloro-pyridin-3-yl)-7-aza-bicyclo[2.2.1]heptane CHEMBL298517 | US9284322, (-)-epibatidine
TypeSmall organic molecule
Emp. Form.C11H13ClN2
Mol. Mass.208.687
SMILESClc1ccc(cn1)[C@@H]1C[C@H]2CC[C@@H]1N2