Reaction Details
TargetIntegrin alpha-V/beta-3
LigandBDBM50204824
Substrate/Competitorn/a
Meas. Tech.ChEMBL_454494 (CHEMBL886520)
IC50 35±n/a nM
Citation Gentilucci, LCardillo, GSquassabia, FTolomelli, ASpampinato, SSparta, ABaiula, M Inhibition of cancer cell adhesion by heterochiral Pro-containing RGD mimetics. Bioorg Med Chem Lett17:2329-33 (2007) 
 
Integrin alpha-V/beta-3
Name:Integrin alpha-V/beta-3
Type:Enzyme
Mol. Mass.:n/a
Description:n/a
Components:This complex has 2 components.
Component 1
Name:Integrin alpha-V
Synonyms:ITAV_HUMAN Integrin alpha-V/alpha-5 VNRA Vitronectin receptor | Vitronectin receptor subunit alpha
Type:PROTEIN
Mol. Mass.:116024.92
Organism:Homo sapiens (Human)
Description:ChEMBL_582336
Residue:1048
Component 2
Name:Integrin beta-3
Synonyms:CD_antigen=CD61 GPIIIa ITGB3 Platelet membrane glycoprotein IIIa
Type:Protein
Mol. Mass.:87038.91
Organism:Homo sapiens (Human)
Description:P05106
Residue:788
BDBM50204824
NameBDBM50204824
Synonyms:(S)-4-benzylcarbamoyl-4-{[(R)-1-(3-guanidino-propionyl)-pyrrolidine-2-carbonyl]-amino}-butyric acid | CHEMBL240222
TypeSmall organic molecule
Emp. Form.C21H30N6O5
Mol. Mass.446.5001
SMILES[#7]\[#6](-[#7])=[#7]\[#6]-[#6]-[#6](=O)-[#7]-1-[#6]-[#6]-[#6]-[#6@@H]-1-[#6](=O)-[#7]-[#6@@H](-[#6]-[#6]-[#6](-[#8])=O)-[#6](=O)-[#7]-[#6]-c1ccccc1