Reaction Details
TargetThyroid hormone receptor alpha
LigandBDBM18867
Substrate/Competitorn/a
Meas. Tech.ChEMBL_459042 (CHEMBL925134)
IC50 1.55±n/a nM
Citation Valadares, NFCastilho, MSPolikarpov, IGarratt, RC 2D QSAR studies on thyroid hormone receptor ligands. Bioorg Med Chem15:4609-17 (2007) 
 
Thyroid hormone receptor alpha
Name:Thyroid hormone receptor alpha
Type:Receptor
Mol. Mass.:54818.00
Organism:Homo sapiens (Human)
Description:Recombinant hThR was obtained from nuclear extracts from SF9 cells infected with baculovirus vectors encoding for ThRalpha 1.
Residue:490
BDBM18867
NameBDBM18867
Synonyms:2-{3,5-dibromo-4-[4-hydroxy-3-(propan-2-yl)phenoxy]phenyl}acetic acid dibromo phenylacetic acid, 11a
TypeSmall organic molecule
Emp. Form.C17H16Br2O4
Mol. Mass.444.115
SMILESCC(C)c1cc(Oc2c(Br)cc(CC(O)=O)cc2Br)ccc1O