Reaction Details
TargetThyroid hormone receptor alpha
LigandBDBM18866
Substrate/Competitorn/a
Meas. Tech.ChEMBL_459042 (CHEMBL925134)
IC50 9.77±n/a nM
Citation Valadares, NFCastilho, MSPolikarpov, IGarratt, RC 2D QSAR studies on thyroid hormone receptor ligands. Bioorg Med Chem15:4609-17 (2007) 
 
Thyroid hormone receptor alpha
Name:Thyroid hormone receptor alpha
Type:Receptor
Mol. Mass.:54818.00
Organism:Homo sapiens (Human)
Description:Recombinant hThR was obtained from nuclear extracts from SF9 cells infected with baculovirus vectors encoding for ThRalpha 1.
Residue:490
BDBM18866
NameBDBM18866
Synonyms:3,5-dibromo-4-[4-hydroxy-3-(propan-2-yl)phenoxy]benzoic acid | dibromo benzoic acid, 7
TypeSmall organic molecule
Emp. Form.C16H14Br2O4
Mol. Mass.430.088
SMILESCC(C)c1cc(Oc2c(Br)cc(cc2Br)C(O)=O)ccc1O