Reaction Details
TargetThyroid hormone receptor beta
LigandBDBM18869
Substrate/Competitorn/a
Meas. Tech.ChEMBL_459043 (CHEMBL925135)
IC50 1.1±n/a nM
Citation Valadares, NFCastilho, MSPolikarpov, IGarratt, RC 2D QSAR studies on thyroid hormone receptor ligands. Bioorg Med Chem15:4609-17 (2007) 
 
Thyroid hormone receptor beta
Name:Thyroid hormone receptor beta
Type:Receptor
Mol. Mass.:52793.62
Organism:Homo sapiens (Human)
Description:Recombinant hThR was obtained from nuclear extracts from SF9 cells infected with baculovirus vectors encoding for ThRbeta 1.
Residue:461
BDBM18869
NameBDBM18869
Synonyms:2-{3,5-dichloro-4-[4-hydroxy-3-(propan-2-yl)phenoxy]phenyl}acetic acid KB-141
TypeSmall organic molecule
Emp. Form.C17H16Cl2O4
Mol. Mass.355.213
SMILESCC(C)c1cc(Oc2c(Cl)cc(CC(O)=O)cc2Cl)ccc1O