Reaction Details
TargetThyroid hormone receptor beta
LigandBDBM18864
Substrate/Competitorn/a
Meas. Tech.ChEMBL_459043 (CHEMBL925135)
IC50 0.0191±n/a nM
Citation Valadares, NFCastilho, MSPolikarpov, IGarratt, RC 2D QSAR studies on thyroid hormone receptor ligands. Bioorg Med Chem15:4609-17 (2007) 
 
Thyroid hormone receptor beta
Name:Thyroid hormone receptor beta
Type:Receptor
Mol. Mass.:52793.62
Organism:Homo sapiens (Human)
Description:Recombinant hThR was obtained from nuclear extracts from SF9 cells infected with baculovirus vectors encoding for ThRbeta 1.
Residue:461
BDBM18864
NameBDBM18864
Synonyms:3-[4-(4-hydroxy-3-iodophenoxy)-3,5-diiodophenyl]propanoic acid cid_5804 | triiodothyropropionic acid, 5
TypeSmall organic molecule
Emp. Form.C15H11I3O4
Mol. Mass.635.9589
SMILESOC(=O)CCc1cc(I)c(Oc2ccc(O)c(I)c2)c(I)c1