Reaction Details
TargetHeparanase
LigandBDBM50165639
Substrate/Competitorn/a
Meas. Tech.ChEMBL_531583 (CHEMBL990587)
IC50 200±n/a nM
Citation Jalali-Heravi, MAsadollahi-Baboli, MShahbazikhah, P QSAR study of heparanase inhibitors activity using artificial neural networks and Levenberg-Marquardt algorithm. Eur J Med Chem43:548-56 (2008) 
 
Heparanase
Name:Heparanase
Type:PROTEIN
Mol. Mass.:61167.67
Organism:Homo sapiens (Human)
Description:ChEMBL_327900
Residue:543
BDBM50165639
NameBDBM50165639
Synonyms:(2-{4-[2-(2,4-Dichloro-phenylcarbamoyl)-vinyl]-2-fluoro-phenyl}-benzooxazol-5-yl)-acetic acid CHEMBL196746
TypeSmall organic molecule
Emp. Form.C24H15Cl2FN2O4
Mol. Mass.485.291
SMILESOC(=O)Cc1ccc2oc(nc2c1)-c1ccc(\C=C\C(=O)Nc2ccc(Cl)cc2Cl)cc1F