Reaction Details
TargetHeparanase
LigandBDBM50165669
Substrate/Competitorn/a
Meas. Tech.ChEMBL_531583 (CHEMBL990587)
IC50 200±n/a nM
Citation Jalali-Heravi, MAsadollahi-Baboli, MShahbazikhah, P QSAR study of heparanase inhibitors activity using artificial neural networks and Levenberg-Marquardt algorithm. Eur J Med Chem43:548-56 (2008) 
 
Heparanase
Name:Heparanase
Type:PROTEIN
Mol. Mass.:61167.67
Organism:Homo sapiens (Human)
Description:ChEMBL_327900
Residue:543
BDBM50165669
NameBDBM50165669
Synonyms:(2-{4-[2-(3-Bromo-phenylcarbamoyl)-vinyl]-2-fluoro-phenyl}-benzooxazol-5-yl)-acetic acid CHEMBL193625
TypeSmall organic molecule
Emp. Form.C24H16BrFN2O4
Mol. Mass.495.297
SMILESOC(=O)Cc1ccc2oc(nc2c1)-c1ccc(\C=C\C(=O)Nc2cccc(Br)c2)cc1F