Reaction Details
TargetHeparanase
LigandBDBM50412099
Substrate/Competitorn/a
Meas. Tech.ChEMBL_531583 (CHEMBL990587)
IC50 346.74±n/a nM
Citation Jalali-Heravi, MAsadollahi-Baboli, MShahbazikhah, P QSAR study of heparanase inhibitors activity using artificial neural networks and Levenberg-Marquardt algorithm. Eur J Med Chem43:548-56 (2008) 
 
Heparanase
Name:Heparanase
Type:PROTEIN
Mol. Mass.:61167.67
Organism:Homo sapiens (Human)
Description:ChEMBL_327900
Residue:543
BDBM50412099
NameBDBM50412099
Synonyms:CHEMBL522358
TypeSmall organic molecule
Emp. Form.C24H15F3N2O4
Mol. Mass.452.3821
SMILESOC(=O)Cc1ccc2oc(nc2c1)-c1ccc(NC(=O)\C=C\c2ccc(F)cc2F)c(F)c1