Reaction Details
TargetHeparanase
LigandBDBM50147537
Substrate/Competitorn/a
Meas. Tech.ChEMBL_531583 (CHEMBL990587)
IC50 398.11±n/a nM
Citation Jalali-Heravi, MAsadollahi-Baboli, MShahbazikhah, P QSAR study of heparanase inhibitors activity using artificial neural networks and Levenberg-Marquardt algorithm. Eur J Med Chem43:548-56 (2008) 
 
Heparanase
Name:Heparanase
Type:PROTEIN
Mol. Mass.:61167.67
Organism:Homo sapiens (Human)
Description:ChEMBL_327900
Residue:543
BDBM50147537
NameBDBM50147537
Synonyms:2-(5-(5-(4-fluorophenyl)benzo[d]oxazol-2-yl)-2-methoxyphenyl)-1,3-dioxoisoindoline-5-carboxylic acid CHEMBL324065
TypeSmall organic molecule
Emp. Form.C29H17FN2O6
Mol. Mass.508.4535
SMILESCOc1ccc(cc1N1C(=O)c2ccc(cc2C1=O)C(O)=O)-c1nc2cc(ccc2o1)-c1ccc(F)cc1