Reaction Details
TargetCalcium-activated potassium channel subunit alpha-1
LigandBDBM50412107
Substrate/Competitorn/a
Meas. Tech.ChEMBL_532343 (CHEMBL973266)
IC50 27542.29±n/a nM
Citation Calderone, VFiamingo, FLAmato, GGiorgi, ILivi, OMartelli, AMartinotti, E New amido derivatives as potential BKCa potassium channel activators. XI. Eur J Med Chem43:792-9 (2008) 
 
Calcium-activated potassium channel subunit alpha-1
Name:Calcium-activated potassium channel subunit alpha-1
Type:PROTEIN
Mol. Mass.:134382.76
Organism:Rattus norvegicus
Description:ChEMBL_510400
Residue:1209
BDBM50412107
NameBDBM50412107
Synonyms:CHEMBL452008
TypeSmall organic molecule
Emp. Form.C15H11F4NO
Mol. Mass.297.2476
SMILESFc1ccccc1NC(=O)Cc1ccccc1C(F)(F)F