Reaction Details
Target5-hydroxytryptamine receptor 1D
LigandBDBM50412116
Substrate/Competitorn/a
Meas. Tech.ChEMBL_556307 (CHEMBL954042)
Ki 2.5±n/a nM
Citation Ward, SEEddershaw, PJScott, CMGordon, LJLovell, PJMoore, SHSmith, PWStarr, KRThewlis, KMWatson, JM Discovery of potent, orally bioavailable, selective 5-HT1A/B/D receptor antagonists. J Med Chem51:2887-90 (2008) 
 
5-hydroxytryptamine receptor 1D
Name:5-hydroxytryptamine receptor 1D
Type:G Protein-Coupled Receptor (GPCR)
Mol. Mass.:41920.63
Organism:Homo sapiens (Human)
Description:Receptor binding assays were performed using human clone stably expressed in CHO cells.
Residue:377
BDBM50412116
NameBDBM50412116
Synonyms:CHEMBL494992
TypeSmall organic molecule
Emp. Form.C24H29N3O2
Mol. Mass.391.506
SMILESCOc1cccc(CN2CCN(CCOc3cccc4nc(C)ccc34)CC2)c1