Reaction Details
Target5-hydroxytryptamine receptor 1A
LigandBDBM50412126
Substrate/Competitorn/a
Meas. Tech.ChEMBL_556305 (CHEMBL954040)
Ki 32±n/a nM
Citation Ward, SEEddershaw, PJScott, CMGordon, LJLovell, PJMoore, SHSmith, PWStarr, KRThewlis, KMWatson, JM Discovery of potent, orally bioavailable, selective 5-HT1A/B/D receptor antagonists. J Med Chem51:2887-90 (2008) 
 
5-hydroxytryptamine receptor 1A
Name:5-hydroxytryptamine receptor 1A
Type:n/a
Mol. Mass.:46122.49
Organism:Homo sapiens (Human)
Description:n/a
Residue:422
BDBM50412126
NameBDBM50412126
Synonyms:CHEMBL525362
TypeSmall organic molecule
Emp. Form.C27H34N4O2
Mol. Mass.446.5845
SMILESCCNC(=O)Nc1cccc(CC2CCN(CCOc3cccc4nc(C)ccc34)CC2)c1