Reaction Details
Target5-hydroxytryptamine receptor 1D
LigandBDBM50412129
Substrate/Competitorn/a
Meas. Tech.ChEMBL_556307 (CHEMBL954042)
Ki 1.3±n/a nM
Citation Ward, SEEddershaw, PJScott, CMGordon, LJLovell, PJMoore, SHSmith, PWStarr, KRThewlis, KMWatson, JM Discovery of potent, orally bioavailable, selective 5-HT1A/B/D receptor antagonists. J Med Chem51:2887-90 (2008) 
 
5-hydroxytryptamine receptor 1D
Name:5-hydroxytryptamine receptor 1D
Type:G Protein-Coupled Receptor (GPCR)
Mol. Mass.:41920.63
Organism:Homo sapiens (Human)
Description:Receptor binding assays were performed using human clone stably expressed in CHO cells.
Residue:377
BDBM50412129
NameBDBM50412129
Synonyms:CHEMBL498355
TypeSmall organic molecule
Emp. Form.C28H35N3O2
Mol. Mass.445.5964
SMILESCC(C)C(=O)Nc1cccc(CC2CCN(CCOc3cccc4nc(C)ccc34)CC2)c1