Reaction Details
Target5-hydroxytryptamine receptor 2B
LigandBDBM50412131
Substrate/Competitorn/a
Meas. Tech.ChEMBL_556319 (CHEMBL954054)
Ki<1000±n/a nM
Citation Ward, SEEddershaw, PJScott, CMGordon, LJLovell, PJMoore, SHSmith, PWStarr, KRThewlis, KMWatson, JM Discovery of potent, orally bioavailable, selective 5-HT1A/B/D receptor antagonists. J Med Chem51:2887-90 (2008) 
 
5-hydroxytryptamine receptor 2B
Name:5-hydroxytryptamine receptor 2B
Type:G Protein-Coupled Receptor (GPCR)
Mol. Mass.:54312.47
Organism:Homo sapiens (Human)
Description:Receptor binding assays were performed using human clone stably expressed in CHO cells.
Residue:481
BDBM50412131
NameBDBM50412131
Synonyms:CHEMBL522708
TypeSmall organic molecule
Emp. Form.C27H33N3O3S
Mol. Mass.479.634
SMILESCc1ccc2c(OCCN3CCC(Cc4cccc(c4)N4CCCS4(=O)=O)CC3)cccc2n1