Reaction Details
TargetSodium-dependent serotonin transporter
LigandBDBM50412131
Substrate/Competitorn/a
Meas. Tech.ChEMBL_556325 (CHEMBL954060)
Ki 398±n/a nM
Citation Ward, SEEddershaw, PJScott, CMGordon, LJLovell, PJMoore, SHSmith, PWStarr, KRThewlis, KMWatson, JM Discovery of potent, orally bioavailable, selective 5-HT1A/B/D receptor antagonists. J Med Chem51:2887-90 (2008) 
 
Sodium-dependent serotonin transporter
Name:Sodium-dependent serotonin transporter
Type:Multi-pass membrane protein
Mol. Mass.:70322.51
Organism:Homo sapiens (Human)
Description:P31645
Residue:630
BDBM50412131
NameBDBM50412131
Synonyms:CHEMBL522708
TypeSmall organic molecule
Emp. Form.C27H33N3O3S
Mol. Mass.479.634
SMILESCc1ccc2c(OCCN3CCC(Cc4cccc(c4)N4CCCS4(=O)=O)CC3)cccc2n1