Reaction Details
Target5-hydroxytryptamine receptor 2B
LigandBDBM50412132
Substrate/Competitorn/a
Meas. Tech.ChEMBL_556319 (CHEMBL954054)
Ki 1995±n/a nM
Citation Ward, SEEddershaw, PJScott, CMGordon, LJLovell, PJMoore, SHSmith, PWStarr, KRThewlis, KMWatson, JM Discovery of potent, orally bioavailable, selective 5-HT1A/B/D receptor antagonists. J Med Chem51:2887-90 (2008) 
 
5-hydroxytryptamine receptor 2B
Name:5-hydroxytryptamine receptor 2B
Type:G Protein-Coupled Receptor (GPCR)
Mol. Mass.:54312.47
Organism:Homo sapiens (Human)
Description:Receptor binding assays were performed using human clone stably expressed in CHO cells.
Residue:481
BDBM50412132
NameBDBM50412132
Synonyms:CHEMBL497963
TypeSmall organic molecule
Emp. Form.C25H31N3O3S
Mol. Mass.453.597
SMILESCc1ccc2c(OCCN3CCC(Cc4cccc(NS(C)(=O)=O)c4)CC3)cccc2n1