Reaction Details
Target5-hydroxytryptamine receptor 4
LigandBDBM50412132
Substrate/Competitorn/a
Meas. Tech.ChEMBL_556321 (CHEMBL954056)
Ki<10000±n/a nM
Citation Ward, SEEddershaw, PJScott, CMGordon, LJLovell, PJMoore, SHSmith, PWStarr, KRThewlis, KMWatson, JM Discovery of potent, orally bioavailable, selective 5-HT1A/B/D receptor antagonists. J Med Chem51:2887-90 (2008) 
 
5-hydroxytryptamine receptor 4
Name:5-hydroxytryptamine receptor 4
Type:Enzyme
Mol. Mass.:43767.54
Organism:Homo sapiens (Human)
Description:Q13639
Residue:388
BDBM50412132
NameBDBM50412132
Synonyms:CHEMBL497963
TypeSmall organic molecule
Emp. Form.C25H31N3O3S
Mol. Mass.453.597
SMILESCc1ccc2c(OCCN3CCC(Cc4cccc(NS(C)(=O)=O)c4)CC3)cccc2n1