Reaction Details
TargetD(2) dopamine receptor
LigandBDBM50412132
Substrate/Competitorn/a
Meas. Tech.ChEMBL_556326 (CHEMBL954061)
Ki 63±n/a nM
Citation Ward, SEEddershaw, PJScott, CMGordon, LJLovell, PJMoore, SHSmith, PWStarr, KRThewlis, KMWatson, JM Discovery of potent, orally bioavailable, selective 5-HT1A/B/D receptor antagonists. J Med Chem51:2887-90 (2008) 
 
D(2) dopamine receptor
Name:D(2) dopamine receptor
Type:Cell-surface receptors
Mol. Mass.:50647.10
Organism:Homo sapiens (Human)
Description:P14416
Residue:443
BDBM50412132
NameBDBM50412132
Synonyms:CHEMBL497963
TypeSmall organic molecule
Emp. Form.C25H31N3O3S
Mol. Mass.453.597
SMILESCc1ccc2c(OCCN3CCC(Cc4cccc(NS(C)(=O)=O)c4)CC3)cccc2n1