Reaction Details
TargetPotassium voltage-gated channel subfamily H member 2
LigandBDBM50117930
Substrate/Competitorn/a
Meas. Tech.ChEMBL_556369 (CHEMBL954102)
IC50 19.95±n/a nM
Citation Jia, LSun, H Support vector machines classification of hERG liabilities based on atom types. Bioorg Med Chem16:6252-60 (2008) 
 
Potassium voltage-gated channel subfamily H member 2
Name:Potassium voltage-gated channel subfamily H member 2
Type:Multi-pass membrane protein
Mol. Mass.:126672.65
Organism:Homo sapiens (Human)
Description:Q12809
Residue:1159
BDBM50117930
NameBDBM50117930
Synonyms:(4-{1-[2-(6-Methyl-pyridin-2-yl)-ethyl]-piperidine-4-carbonyl}-phenyl)-methanesulfonamide CHEMBL327980 E-4031 N-(4-(1-(2-(6-methylpyridin-2-yl)ethyl)piperidine-4-carbonyl)phenyl)methanesulfonamide N-(4-{1-[2-(6-Methyl-pyridin-2-yl)-ethyl]-piperidine-4-carbonyl}-phenyl)-methanesulfonamide (E-4031)
TypeSmall organic molecule
Emp. Form.C21H27N3O3S
Mol. Mass.401.522
SMILESCc1cccc(CCN2CCC(CC2)C(=O)c2ccc(NS(C)(=O)=O)cc2)n1