Reaction Details
TargetPotassium voltage-gated channel subfamily H member 2
LigandBDBM22876
Substrate/Competitorn/a
Meas. Tech.ChEMBL_556369 (CHEMBL954102)
IC50 169.82±n/a nM
Citation Jia, LSun, H Support vector machines classification of hERG liabilities based on atom types. Bioorg Med Chem16:6252-60 (2008) 
 
Potassium voltage-gated channel subfamily H member 2
Name:Potassium voltage-gated channel subfamily H member 2
Type:Multi-pass membrane protein
Mol. Mass.:126672.65
Organism:Homo sapiens (Human)
Description:Q12809
Residue:1159
BDBM22876
NameBDBM22876
Synonyms:CHEMBL998 Loratadine US9138431, LORATADINE (Claritin) ethyl 4-{13-chloro-4-azatricyclo[9.4.0.0^{3,8}]pentadeca-1(11),3(8),4,6,12,14-hexaen-2-ylidene}piperidine-1-carboxylate
TypeSmall organic molecule
Emp. Form.C22H23ClN2O2
Mol. Mass.382.883
SMILES[#6]-[#6]-[#8]-[#6](=O)-[#7]-1-[#6]-[#6]\[#6](-[#6]-[#6]-1)=[#6]-1\c2ccc(Cl)cc2-[#6]-[#6]-c2cccnc-12