Reaction Details
TargetAlpha-2B adrenergic receptor
LigandBDBM50412244
Substrate/Competitorn/a
Meas. Tech.ChEMBL_487923 (CHEMBL1016577)
EC50 501±n/a nM
Citation Gentili, FCardinaletti, CVesprini, CCarrieri, AGhelfi, FFarande, AGiannella, MPiergentili, AQuaglia, WLaurila, JMHuhtinen, AScheinin, MPigini, M Alpha2-adrenoreceptors profile modulation. 4. From antagonist to agonist behavior. J Med Chem51:4289-99 (2008) 
 
Alpha-2B adrenergic receptor
Name:Alpha-2B adrenergic receptor
Type:Enzyme
Mol. Mass.:49964.20
Organism:Homo sapiens (Human)
Description:P18089
Residue:450
BDBM50412244
NameBDBM50412244
Synonyms:CHEMBL495096
TypeSmall organic molecule
Emp. Form.C16H22N2O
Mol. Mass.258.3587
SMILESCC(Oc1ccccc1C1CCCC1)C1=NCCN1