Reaction Details
TargetCalcium-activated potassium channel subunit alpha-1
LigandBDBM50412335
Substrate/Competitorn/a
Meas. Tech.ChEMBL_510400 (CHEMBL1000350)
IC50 6309.57±n/a nM
Citation Calderone, VSpogli, RMartelli, AManfroni, GTestai, LSabatini, STabarrini, OCecchetti, V Novel 1,4-benzothiazine derivatives as large conductance Ca2+-activated potassium channel openers. J Med Chem51:5085-92 (2008) 
 
Calcium-activated potassium channel subunit alpha-1
Name:Calcium-activated potassium channel subunit alpha-1
Type:PROTEIN
Mol. Mass.:134382.76
Organism:Rattus norvegicus
Description:ChEMBL_510400
Residue:1209
BDBM50412335
NameBDBM50412335
Synonyms:CHEMBL498702
TypeSmall organic molecule
Emp. Form.C17H13BrF3NO3S
Mol. Mass.448.254
SMILESCOc1ccc(Br)cc1[C@@H](O)[C@H]1Sc2ccc(cc2NC1=O)C(F)(F)F