Reaction Details
Target3-oxoacyl-[acyl-carrier-protein] synthase 3
LigandBDBM23581
Substrate/Competitorn/a
Meas. Tech.ChEMBL_510888 (CHEMBL997780)
IC50 1100±n/a nM
Citation Singh, SSoni, LKGupta, MKPrabhakar, YSKaskhedikar, SG QSAR studies on benzoylaminobenzoic acid derivatives as inhibitors of beta-ketoacyl-acyl carrier protein synthase III. Eur J Med Chem43:1071-80 (2008) 
 
3-oxoacyl-[acyl-carrier-protein] synthase 3
Name:3-oxoacyl-[acyl-carrier-protein] synthase 3
Type:Acyltransferase; homodimer
Mol. Mass.:35176.53
Organism:Enterococcus faecalis
Description:The E. faecalis FabH was cloned, and protein was expressed in E. coli.
Residue:321
BDBM23581
NameBDBM23581
Synonyms:(3-Phenoxybenzoylamino)benzoic acid deriv., 23b | 2-[(4-bromo-3-phenoxybenzene)amido]benzoic acid
TypeSmall organic molecule
Emp. Form.C20H14BrNO4
Mol. Mass.412.233
SMILESOC(=O)c1ccccc1NC(=O)c1ccc(Br)c(Oc2ccccc2)c1