Reaction Details
Target3-oxoacyl-[acyl-carrier-protein] synthase 3
LigandBDBM23600
Substrate/Competitorn/a
Meas. Tech.ChEMBL_510888 (CHEMBL997780)
IC50 790.68±n/a nM
Citation Singh, SSoni, LKGupta, MKPrabhakar, YSKaskhedikar, SG QSAR studies on benzoylaminobenzoic acid derivatives as inhibitors of beta-ketoacyl-acyl carrier protein synthase III. Eur J Med Chem43:1071-80 (2008) 
 
3-oxoacyl-[acyl-carrier-protein] synthase 3
Name:3-oxoacyl-[acyl-carrier-protein] synthase 3
Type:Acyltransferase; homodimer
Mol. Mass.:35176.53
Organism:Enterococcus faecalis
Description:The E. faecalis FabH was cloned, and protein was expressed in E. coli.
Residue:321
BDBM23600
NameBDBM23600
Synonyms:(3-Phenoxybenzoylamino)benzoic acid deriv., 24j | 2-({3-phenoxy-4-[3-(propan-2-yl)phenyl]benzene}amido)benzoic acid
TypeSmall organic molecule
Emp. Form.C29H25NO4
Mol. Mass.451.5131
SMILESCC(C)c1cccc(c1)-c1ccc(cc1Oc1ccccc1)C(=O)Nc1ccccc1C(O)=O