Reaction Details
Target3-oxoacyl-[acyl-carrier-protein] synthase 3
LigandBDBM23574
Substrate/Competitorn/a
Meas. Tech.ChEMBL_510888 (CHEMBL997780)
IC50 11402.5±n/a nM
Citation Singh, SSoni, LKGupta, MKPrabhakar, YSKaskhedikar, SG QSAR studies on benzoylaminobenzoic acid derivatives as inhibitors of beta-ketoacyl-acyl carrier protein synthase III. Eur J Med Chem43:1071-80 (2008) 
 
3-oxoacyl-[acyl-carrier-protein] synthase 3
Name:3-oxoacyl-[acyl-carrier-protein] synthase 3
Type:Acyltransferase; homodimer
Mol. Mass.:35176.53
Organism:Enterococcus faecalis
Description:The E. faecalis FabH was cloned, and protein was expressed in E. coli.
Residue:321
BDBM23574
NameBDBM23574
Synonyms:2-{[3-(diethylsulfamoyl)-4-methoxybenzene]amido}benzoic acid | Diethylsulfonamide Derivative, 13d
TypeSmall organic molecule
Emp. Form.C19H22N2O6S
Mol. Mass.406.453
SMILESCCN(CC)S(=O)(=O)c1cc(ccc1OC)C(=O)Nc1ccccc1C(O)=O