Reaction Details
Target3-oxoacyl-[acyl-carrier-protein] synthase 3
LigandBDBM23606
Substrate/Competitorn/a
Meas. Tech.ChEMBL_510888 (CHEMBL997780)
IC50 160.32±n/a nM
Citation Singh, SSoni, LKGupta, MKPrabhakar, YSKaskhedikar, SG QSAR studies on benzoylaminobenzoic acid derivatives as inhibitors of beta-ketoacyl-acyl carrier protein synthase III. Eur J Med Chem43:1071-80 (2008) 
 
3-oxoacyl-[acyl-carrier-protein] synthase 3
Name:3-oxoacyl-[acyl-carrier-protein] synthase 3
Type:Acyltransferase; homodimer
Mol. Mass.:35176.53
Organism:Enterococcus faecalis
Description:The E. faecalis FabH was cloned, and protein was expressed in E. coli.
Residue:321
BDBM23606
NameBDBM23606
Synonyms:(3-Phenoxybenzoylamino)benzoic acid deriv., 24p | 2-{[4-(2,4-difluorophenyl)-3-phenoxybenzene]amido}benzoic acid
TypeSmall organic molecule
Emp. Form.C26H17F2NO4
Mol. Mass.445.4143
SMILESOC(=O)c1ccccc1NC(=O)c1ccc(c(Oc2ccccc2)c1)-c1ccc(F)cc1F