Reaction Details
TargetD(1A) dopamine receptor
LigandBDBM50219140
Substrate/Competitorn/a
Meas. Tech.ChEMBL_491079 (CHEMBL982102)
Ki 28.18±n/a nM
Citation Enzensperger, CGörnemann, TPertz, HHLehmann, J Dopamine/serotonin receptor ligands. Part 17: a cross-target SAR approach: affinities of azecine-styled ligands for 5-HT(2A) versus D1 and D2 receptors. Bioorg Med Chem Lett18:3809-13 (2008) 
 
D(1A) dopamine receptor
Name:D(1A) dopamine receptor
Type:Enzyme
Mol. Mass.:49303.43
Organism:Homo sapiens (Human)
Description:P21728
Residue:446
BDBM50219140
NameBDBM50219140
Synonyms:12-methoxy-7-methyl-6,7,8,9,10,15-hexahydro-5H-dibenzo[d,g]azacycloundecene CHEMBL389357
TypeSmall organic molecule
Emp. Form.C20H25NO
Mol. Mass.295.4186
SMILESCOc1ccc2Cc3ccccc3CCN(C)CCCc2c1