Reaction Details
TargetD(1A) dopamine receptor
LigandBDBM50412384
Substrate/Competitorn/a
Meas. Tech.ChEMBL_491079 (CHEMBL982102)
Ki 3.72±n/a nM
Citation Enzensperger, CGörnemann, TPertz, HHLehmann, J Dopamine/serotonin receptor ligands. Part 17: a cross-target SAR approach: affinities of azecine-styled ligands for 5-HT(2A) versus D1 and D2 receptors. Bioorg Med Chem Lett18:3809-13 (2008) 
 
D(1A) dopamine receptor
Name:D(1A) dopamine receptor
Type:Enzyme
Mol. Mass.:49303.43
Organism:Homo sapiens (Human)
Description:P21728
Residue:446
BDBM50412384
NameBDBM50412384
Synonyms:CHEMBL508399
TypeSmall organic molecule
Emp. Form.C19H23NO
Mol. Mass.281.392
SMILESCCN1CCc2ccccc2Cc2ccc(O)cc2CC1